BDBM50100570 CHEMBL3321879
SMILES COc1ccc(CN2CCCC2)cc1OC(=O)N(C)C
InChI Key InChIKey=UUUILDZMZNGUPH-UHFFFAOYSA-N
Data  2 IC50
  Tab Delimited (TSV)   2D SDfile   Computed 3D by Vconf -m prep SDfile
Find this compound or compounds like it in BindingDB:
Activity Spreadsheet -- Enzyme Inhibition Constant Data from BindingDB
Found 1 hit for monomerid = 50100570
TargetCarboxylic ester hydrolase(Rattus norvegicus (rat))
Zhejiang University
Curated by ChEMBL
LigandPNGBDBM50100570(CHEMBL3321879)
Affinity DataIC50:  29nM. Assay description: Inhibition of BChE in rat serum using butyrylthiocholine iodide substrate incubated for 15 mins by UV spectroscopy based Ellman's method
In DepthDetails ArticlePubMed